WebKit-https.git
2019-04-16 mmaxfield@apple.com[Cocoa] FontPlatformData objects aren't cached at all...
2019-04-16 sbarati@apple.comSafeToExecute for GetByOffset/GetGetterByOffset/PutByOf...
2019-04-16 rmorisset@apple.comDFG should be able to constant fold Object.create(...
2019-04-16 drousso@apple.comWeb Inspector: fake value descriptors for promises...
2019-04-16 nvasilyev@apple.comUnreviewed, fix typo in a comment.
2019-04-16 dean_johnson... Using Tools/Scripts/clean-webkit should not install...
2019-04-15 rmorisset@apple.comB3::Value should have different kinds of adjacency...
2019-04-15 drousso@apple.comWeb Inspector: Heap: don't use recursion when calculati...
2019-04-15 achristensen... Add a DiagnosticLogging method taking an arbitrary...
2019-04-15 aakash_jain... ews-build should clearly indicate flaky test failures
2019-04-15 sroberts@apple.comstorage/indexeddb/modern/gc-closes-database-private...
2019-04-15 dino@apple.comProvide option to not create a longpress gesture recognizer
2019-04-15 sroberts@apple.comimported/w3c/web-platform-tests/hr-time/test_cross_fram...
2019-04-15 tzagallo@apple.comBytecode cache should not encode the SourceProvider...
2019-04-15 bfulgham@apple.comInjectedBundle parameters often need initialization...
2019-04-15 rmorisset@apple.comMarkedSpace.cpp is not in the Xcode workspace
2019-04-15 justin_fan... Let WTF::convertSafely deduce types from arguments.
2019-04-15 dino@apple.comProvide option to not create a longpress gesture recognizer
2019-04-15 tzagallo@apple.comIncremental bytecode cache should not append function...
2019-04-15 pecoraro@apple.comWeb Inspector: SameSite parsing should be stricter
2019-04-15 rniwa@webkit.orgThrow TypeError when custom element constructor returns...
2019-04-15 don.olmstead... [CMake] WebCore derived sources should only be referenc...
2019-04-15 zalan@apple.comDrawingArea should only capture painting related milestones
2019-04-15 pecoraro@apple.comWeb Inspector: CPU Usage Timeline - Energy impact popov...
2019-04-15 rniwa@webkit.orgHashTable::removeIf always shrinks the hash table by...
2019-04-15 wilander@apple.comSend delayed Ad Click Attribution conversion requests...
2019-04-15 sbarati@apple.commergeOSREntryValue is wrong when the incoming value...
2019-04-15 rmorisset@apple.comSeveral structures and enums in the Yarr interpreter...
2019-04-15 drousso@apple.comWeb Inspector: REGRESSION(r244172): crash when trying...
2019-04-15 aakash_jain... [ews-app] status-bubble should display position in...
2019-04-15 aakash_jain... [ews-build] Do not run clean build by default on EWS...
2019-04-15 drousso@apple.comWeb Inspector: REGRESSION(r244268): Canvas: navigation...
2019-04-15 drousso@apple.comWebDriver: Set Cookie endpoint does not correctly set...
2019-04-15 drousso@apple.comREGRESSION (r240644): Layout Test inspector/page/overri...
2019-04-15 drousso@apple.comWeb Inspector: DOMDebugger: move breakpoint storage...
2019-04-15 drousso@apple.comWeb Inspector: drag/drop over the sidebar should load...
2019-04-15 cdumez@apple.comRegression(r237903) Speedometer 2 is 1-2% regressed...
2019-04-15 said@apple.comASSERT fires when removing a disallowed clone from...
2019-04-15 drousso@apple.comWeb Inspector: Heap: logging an object from a snapshot...
2019-04-15 drousso@apple.comWeb Inspector: Debugger: deleting a special breakpoint...
2019-04-15 pvollan@apple.comTestRunner::notifyDone() should be safely reentrant
2019-04-15 drousso@apple.comWeb Inspector: Uncaught Exception: null is not an objec...
2019-04-15 drousso@apple.comWeb Inspector: Uncaught Exception: Can't find variable...
2019-04-15 drousso@apple.comWeb Inspector: DOMDebugger: "Attribute Modified" breakp...
2019-04-15 drousso@apple.comWeb Inspector: sidebar panels shouldn't be added as...
2019-04-15 drousso@apple.comWeb Inspector: Elements: event listener change events...
2019-04-15 drousso@apple.comWeb Inspector: replace all uses of `this` with `WI...
2019-04-15 drousso@apple.comWeb Inspector: REGRESSION: Heap: snapshots taken manual...
2019-04-15 drousso@apple.comWeb Inspector: REGRESSION (r244157): Timelines: ruler...
2019-04-15 sroberts@apple.cominspector/canvas/recording-webgl-snapshots.html is...
2019-04-15 sroberts@apple.cominspector/timeline/timeline-recording.html is a flaky...
2019-04-15 sroberts@apple.comLayout tests
2019-04-15 philn@webkit.org[GTK][WPE] Add enable-media websetting
2019-04-15 graouts@webkit.orgEnsure iOS layout traits are used for media controls...
2019-04-15 graouts@webkit.orgEnsure iOS layout traits are used for media controls...
2019-04-15 wenson_hsieh... API test WKAttachmentTests.AddAttachmentToConnectedImag...
2019-04-15 Hironori.Fujii... [WinCairo][WKL] Unreviewed test gardening.
2019-04-15 aakash_jain... Disable Flaky API Test WKAttachmentTests.AddAttachmentT...
2019-04-14 commit-queue... Link prefetch not useful for top-level navigation
2019-04-14 dino@apple.comExtract UTI mapping and allow for additions
2019-04-14 aestes@apple.com[Cocoa] WKCustomProtocolLoader should store a WeakPtr...
2019-04-14 don.olmstead... [CMake] JavaScriptCore derived sources should only...
2019-04-14 zandobersek... [bmalloc][Linux] Add support for memory status calculation
2019-04-14 cdumez@apple.com[ Mac Debug ] TestWebKitAPI.ProcessSwap.ReuseSuspendedP...
2019-04-13 wenson_hsieh... Unreviewed, try to fix the internal build after r244239
2019-04-13 tzagallo@apple.comCodeCache should check that the UnlinkedCodeBlock was...
2019-04-13 graouts@webkit.orgProvide a quirk to disable Pointer Events
2019-04-13 wenson_hsieh... Enable modern compatibility mode by default in WKWebVie...
2019-04-13 sbarati@apple.comr244079 logically broke shouldSpeculateInt52
2019-04-13 sbarati@apple.comUnreviewed. Build fix after r244233.
2019-04-12 bburg@apple.comWebDriver: fix typo in EnterFullscreen.js in error...
2019-04-12 justin_fan... [Web GPU] Prevent narrowing conversions during Metal...
2019-04-12 ross.kirsling... Unreviewed fix for non-unified build.
2019-04-12 sbarati@apple.comSometimes we need to user fewer CPUs in our threading...
2019-04-12 ross.kirsling... [WinCairo][WKL] Unreviewed test gardening.
2019-04-12 drousso@apple.comWebDriver: evaluating javascript shouldn't fail if...
2019-04-12 rniwa@webkit.orgWebThread should run at a higher priority than user...
2019-04-12 simon.fraser... [iOS WK2] Make -webkit-overflow-scrolling be a no-op
2019-04-12 ryanhaddad... Unreviewed test gardening for Windows.
2019-04-12 rniwa@webkit.orgAdd CSS Shadow Parts as a feature under consideration
2019-04-12 ross.kirsling... WebKit should build successfully even with -DENABLE_UNI...
2019-04-12 zalan@apple.comREGRESSION (r244098): [ Mac WK1 ] Layout Test fast...
2019-04-12 eric.carlson... Update AudioSession route sharing policy
2019-04-12 rmorisset@apple.comUse padding at end of ArrayBuffer
2019-04-12 wenson_hsieh... WebsitePolicies doesn't copy its media source policy...
2019-04-12 wenson_hsieh... [iOS] Software keyboard is shown too frequently on...
2019-04-12 ryanhaddad... [macOS WK1] ASSERTION FAILED: formData in WebCore:...
2019-04-12 graouts@webkit.orgOpt some websites into the simulated mouse events dispa...
2019-04-12 cdumez@apple.com[iOS Sim Debug] ASSERTION FAILED: m_downloads.isEmpty...
2019-04-12 commit-queue... Import WPT preload tests
2019-04-12 simon.fraser... [iOS WK2] Wrong scrolling behavior for nested absolute...
2019-04-12 commit-queue... [GTK][WPE] Fix pacman install-dependencies packages
2019-04-12 rego@igalia.com[css-flex][css-grid] Fix synthesized baseline
2019-04-12 carlosgc@webkit.org[GTK] REGRESSION(r243860): Many tests failing
2019-04-12 ysuzuki@apple.com[JSC] op_has_indexed_property should not assume subscri...
2019-04-12 megan_gardner... Fix flaky LayoutTests/fast/events/autoscroll-when-input...
2019-04-12 simon.fraser... Avoid doing positioned scrolling tree node work for...
2019-04-12 zalan@apple.comTry to fix Windows build.
2019-04-12 aakash_jain... [ews-build] Handle bug titles with unicode characters
2019-04-12 sbarati@apple.comRemove invalid assertion in operationInstanceOfCustom
next