Web Inspector: introduce InspectorFrontendAPI for actions initiated from the applicat...
[WebKit-https.git] / LayoutTests / ChangeLog
2011-11-21 pfeldman@chromium.orgWeb Inspector: introduce InspectorFrontendAPI for actio...
2011-11-21 steveblock@google.comInspector tests flakily crashing on Linux dbg canary
2011-11-21 apavlov@chromium.orgWeb Inspector: [Protocol] Retain a single universal...
2011-11-21 steveblock@google.comASSERTION FAILED: fontCache()->generation() == m_genera...
2011-11-21 commit-queue@webki... Unreviewed, rolling out r100856.
2011-11-21 jochen@chromium.orgImplement Meta referrer
2011-11-21 dmazzoni@google.comAccessibility: Multiselect list boxes need to report...
2011-11-21 yutak@chromium.org[Qt] WebSocket close tests are failing
2011-11-21 commit-queue@webki... [Chromium] Layout test does not return correct misspell...
2011-11-21 bashi@chromium.org[Chromium] Remove old getFontFamilyForCharacters()...
2011-11-21 commit-queue@webki... Rebaseline for border change in r100528
2011-11-21 fpizlo@apple.comShowing the data overlay in OpenStreetMap doesn't work...
2011-11-21 abarth@webkit.orgREGRESSION(r100691): Safari error pages and Growl notif...
2011-11-20 jamesr@google.com[chromium] Update various compositing baselines and...
2011-11-19 commit-queue@webki... Move gamepad to Modules/ (+ some cleanup)
2011-11-19 commit-queue@webki... REGRESSION(r98542): Chromium: CSS text is rendered...
2011-11-19 mihnea@adobe.comPixel results missing for fast/regions/render-region...
2011-11-19 commit-queue@webki... https://bugs.webkit.org/show_bug.cgi?id=72591
2011-11-19 yutak@chromium.org[Qt] Unreviewed, add one failing test to the Skipped...
2011-11-19 adamk@chromium.orgAdd another isfinite assertion failure for fast/borders/
2011-11-19 adamk@chromium.orgRebaseline after r100819.
2011-11-19 jamesr@google.comFix reviewed by lines in ChangeLogs
2011-11-19 jamesr@google.com[chromium] composited layers are blurry with a zoom...
2011-11-19 commit-queue@webki... IDL changes for gamepad support
2011-11-19 commit-queue@webki... Unreviewed, rolling out r100693.
2011-11-19 simon.fraser@apple.comReflection on composited element doesn't update if...
2011-11-19 dcheng@chromium.org[chromium] Use correct backing store for ChromiumDataOb...
2011-11-19 cevans@google.comCrash with ranges across a detached, reparented node...
2011-11-19 adamk@chromium.orgUse canplay instead of canplaythrough in http/tests...
2011-11-18 darin@chromium.org2011-10-24 Darin Fisher <darin@chromium.org>
2011-11-18 xji@chromium.orgREGRESSION: rtl horizontal scrollbar / resize bug ...
2011-11-18 mrobinson@webkit.orgREGRESSION (r99924): broke 2 pasteboard tests on GTK
2011-11-18 adamk@chromium.orgLayout Test accessibility/anonymous-render-block-in...
2011-11-18 tony@chromium.org[chromium] The exclusions tests are all passing. Remove the
2011-11-18 adamk@chromium.org[chromium] Test fast/events/dropzone-002.html is failin...
2011-11-18 adamk@chromium.orgRebaseline chromium expectations after r100800.
2011-11-18 adamk@chromium.orgRebaseline chromium expectations after r100800.
2011-11-18 adamk@chromium.orgLayout Test fast/writing-mode/japanese-rl-text-with...
2011-11-18 commit-queue@webki... Access key should work on all elements.
2011-11-18 adamk@chromium.orgLayout Test accessibility/loading-iframe-sends-notifica...
2011-11-18 adamk@chromium.orgRemove expectation for fast/js/delete-syntax.html,...
2011-11-18 adamk@chromium.orgRemove IMAGE suppression for css3/images/cross-fade...
2011-11-18 jchaffraix@webkit.orgInfinite recursion in WebCore::RenderInline::computeRec...
2011-11-18 simon.fraser@apple.comSource/WebCore: Appearance of compound transform animat...
2011-11-18 adamk@chromium.orgSuppress IMAGE failures for css3/images/cross-fade...
2011-11-18 adamk@chromium.orgASSERTION FAILED: fontCache()->generation() == m_genera...
2011-11-18 timothy_horton@app... -webkit-cross-fade rendered incorrectly in overflow...
2011-11-18 steveblock@google.comASSERTION FAILED: fontCache()->generation() == m_genera...
2011-11-18 steveblock@google.com[Chromium] fast/filesystem/file-writer-abort-depth...
2011-11-18 commit-queue@webki... Add test for strange scrollbars with non-integer scaled...
2011-11-18 steveblock@google.comAnother attempt at rebaselining fast/box-shadow for...
2011-11-18 steveblock@google.comInspector tests flakily crashing on Linux dbg canary
2011-11-18 steveblock@google.com[Chromium] fast/canvas/canvas-alphaImageData-behavior...
2011-11-18 steveblock@google.com[Chromium] fast/canvas/canvas-alphaImageData-behavior...
2011-11-18 philn@webkit.orgUnreviewed, skip another GTK crasher.
2011-11-18 steveblock@google.comRebaseline remaining fast/ tests for Chromium Mac 10...
2011-11-18 steveblock@google.comRebaseline remaining svg/ tests for Chromium Mac 10...
2011-11-18 steveblock@google.comRebaseline fast/writing-mode for Chromium Mac 10.5...
2011-11-18 yutak@chromium.org[Qt] Enable WebSocket hybi tests
2011-11-18 steveblock@google.comRebaseline fast/repaint for Chromium Mac 10.5 CG after...
2011-11-18 pfeldman@chromium.orgWeb Inspector: dispatch messages from the front-end...
2011-11-18 sergio@webkit.org[GTK][WK2] Invalid TestNetscapePlugin path when using...
2011-11-18 steveblock@google.comRebaseline svg/custom for Chromium Mac 10.5 CG after...
2011-11-18 steveblock@google.comRebaseline svg/clip-path for Chromium Mac 10.5 CG after...
2011-11-18 steveblock@google.com[CSSShaders] Implement the computed style for mesh...
2011-11-18 achicu@adobe.com[CSSShaders] Implement the computed style for mesh...
2011-11-18 steveblock@google.comRebaseline fast/box-shadow for Chromium Mac 10.5 after...
2011-11-18 steveblock@google.comRebaseline acid3.html for Chromium Mac 10.5
2011-11-18 caseq@chromium.orgWeb Inspector: [Extensions API] Provide a way for exten...
2011-11-18 philn@webkit.orgUnreviewed, mark media/audio-garbage-collect.html flaky...
2011-11-18 ossy@webkit.org[Qt] fast/canvas/canvas-lineWidth.html timeouts intermi...
2011-11-18 loki@webkit.org[Qt] REGRESSION(r100510): Enable 8 Bit Strings in JavaS...
2011-11-18 commit-queue@webki... Remove initProgressEvent method
2011-11-18 adamk@chromium.orgMove JS recursion counter from V8Proxy to V8BindingPerI...
2011-11-18 pkasting@chromium.org[chromium] acid3.html didn't actually get rebaselined...
2011-11-18 commit-queue@webki... [chromium] Font::drawComplexText can not draw a segment...
2011-11-18 pkasting@chromium.org[chromium] Fix broken expectation.
2011-11-18 pkasting@chromium.org[chromium] Try to rebaseline more tests.
2011-11-18 pkasting@chromium.org[chromium] Attempt to rebaseline a test after crrev...
2011-11-18 pkasting@chromium.org[chromium] Mark some inspector tests as flakily crashing.
2011-11-18 pkasting@chromium.orgUnreviewed, rolling out r100698.
2011-11-18 pkasting@chromium.orgSource/WebCore: Remove cargo-cult copy/pasting of Scrip...
2011-11-17 commit-queue@webki... Absolute child is not repainted when parent opacity...
2011-11-17 enne@google.com[chromium] Unreviewed, rebaseline tests after r100545.
2011-11-17 dmazzoni@google.comUnreviewed - skipping accessibility/loading-iframe...
2011-11-17 commit-queue@webki... Implement CSS3 Images cross-fade() image function
2011-11-17 commit-queue@webki... Crash from positioned generated content under run-in
2011-11-17 commit-queue@webki... Unreviewed, rolling out r100652.
2011-11-17 cfleizach@apple.comAX: The scrollArea is not correctly returning the scrol...
2011-11-17 commit-queue@webki... Unreviewed, rolling out r100659.
2011-11-17 abarth@webkit.orgUnique origins shouldn't remember their scheme, host...
2011-11-17 jchaffraix@webkit.orgCSS table with 100% width can overflow their containing...
2011-11-17 robert@webkit.orgQt-specific results for tests added in r100652
2011-11-17 robert@webkit.orgCSS 2.1 failure: outline-color-* tests fail
2011-11-17 steveblock@google.com[Chromium] fast/filesystem/file-writer-abort-depth...
2011-11-17 cfleizach@apple.comWebKitTestRunner needs to support accessibility-related...
2011-11-17 sergio@webkit.org[GTK] plugins/get-url-notify-with-url-that-fails-to...
2011-11-17 steveblock@google.comASSERTION FAILED: fontCache()->generation() == m_genera...
2011-11-17 steveblock@google.comRebaseline
2011-11-17 steveblock@google.com[Chromium] Layout test failures under Snow Leopard
next