CSS 2.1 failure: margin-collapse-clear-012 fails
[WebKit-https.git] / LayoutTests / ChangeLog
2012-08-30 robert@webkit.orgCSS 2.1 failure: margin-collapse-clear-012 fails
2012-08-30 commit-queue@webki... Add support for blendmode to webkit rendering engine
2012-08-30 wangxianzhu@chromi... [Chromium-Android] Upstream layout test rebaselined...
2012-08-30 tony@chromium.orgMake RenderBox::computeInlineDirectionMargins const
2012-08-30 commit-queue@webki... Fix a crash in SourceBufferList.remove().
2012-08-30 commit-queue@webki... [EFL] Remove redundant entries on the Skipped list
2012-08-30 pfeldman@chromium.orgWeb Inspector: sort object properties when dumping...
2012-08-30 commit-queue@webki... Unreviewed, rolling out r127131.
2012-08-30 ossy@webkit.orgUnreviewed, rolling out r127133.
2012-08-30 commit-queue@webki... [EFL] Remove tests from Skipped list that don't exist
2012-08-30 apavlov@chromium.orgWeb Inspector: Some urls in CSS stylesheets cause error...
2012-08-30 keishi@webkit.orgTick marks don't match thumb when applying padding...
2012-08-30 commit-queue@webki... [WK2][WTR] Add didReceiveServerRedirectForProvisionalLo...
2012-08-30 caseq@chromium.orgREGRESSION(r127039): It broke inspector/timeline/timeli...
2012-08-30 ossy@webkit.org[Qt][WK2] Unreviewed gardening, unskip now passing...
2012-08-30 commit-queue@webki... [CSSRegions]Add support for text-shadow in region styling
2012-08-30 zandobersek@gmail.comUnreviewed GTK gardening.
2012-08-30 ossy@webkit.orgUpdate test expectations to follow common guidelines.
2012-08-30 commit-queue@webki... [EFL] Gardening after r127108
2012-08-30 ossy@webkit.org[Qt] REGRESSION(r122175): fast/loader/document-destruct...
2012-08-30 commit-queue@webki... [EFL] Gardening for fast/forms/range/thumbslider-no...
2012-08-30 antonm@chromium.orgHeap-use-after-free in WebCore::ElementV8Internal:...
2012-08-30 dominik.rottsches... [EFL] Gardening after r127135, r127039
2012-08-30 ossy@webkit.org[Qt] Unreviewed gardening, skip new failing tests.
2012-08-30 zandobersek@gmail.comUnreviewed GTK gardening.
2012-08-30 shinyak@chromium.orgAuthorShadowDOM support for textarea element.
2012-08-30 commit-queue@webki... Layout Test fast/repaint/japanese-rl-selection-repaint...
2012-08-30 yosin@chromium.orgUnreviewed. [Chromium] Rebaseline fast/forms/time-multi...
2012-08-30 noel.gordon@gmail.comWebPImageDecoder progressive decodes fail to decode...
2012-08-30 abarth@webkit.orgsecurity/crypto-random-values-limits.html test the...
2012-08-30 ossy@webkit.org[Qt][WK1] New test css3/filters/null-effect-check.html...
2012-08-30 wangxianzhu@chromi... [Chromium-Android] Upstream layout test expectations...
2012-08-30 commit-queue@webki... [Qt][WK2] ApplicationCache LayoutTests failed
2012-08-30 yosin@chromium.org[Tests] Add test case for right-to-left rendering of...
2012-08-30 commit-queue@webki... Add WebKit prefix to MediaSource, SourceBuffer, & Sourc...
2012-08-30 dmazzoni@google.comAX: Canvas should have a distinct role
2012-08-30 msaboff@apple.comuse after free in WebCore::FileReader::doAbort
2012-08-30 jberlin@webkit.orgASSERTION FAILURE in JSC::JSGlobalData::float32ArrayDes...
2012-08-30 jberlin@webkit.orgMountain Lion missing results for media/controls-withou...
2012-08-30 pdr@google.comUnreviewed update of circle-in-mask-with-shadow test...
2012-08-30 inferno@chromium.orgCrash in WebCore::StyleSheetContents::checkLoadCompleted.
2012-08-30 commit-queue@webki... Source/WebCore: [Gtk] Process Gtk 3.4 smooth scroll...
2012-08-30 dino@apple.comUnreviewed gardening for Mac Lion after r127046.
2012-08-30 roger_fong@apple.comUnreviewed Gardening. platform/win/accessibility/single...
2012-08-29 pdr@google.com Unreviewed rebaseline after r127035
2012-08-29 commit-queue@webki... [chromium] Support high DIP pixel tests with DumpRenderTree
2012-08-29 roger_fong@apple.comUnreviewed Gardening: editing/delete/br-004(5)(6) faili...
2012-08-29 fmalita@chromium.orgUnreviewed, adjusting reftest mask to avoid spurious...
2012-08-29 tony@chromium.orgUnreviewed, mark css3/flexbox/flexitem.html as failing...
2012-08-29 jchaffraix@webkit.orgFinal unreviewed rebaselining after r126683.
2012-08-29 tony@chromium.orgr126257 broke css3/flexbox/flexitem.html
2012-08-29 dgrogan@chromium.orgIndexedDB: Throw TypeError for invalid version parameters
2012-08-29 jberlin@webkit.orgASSERTION FAILED: enclosingIntRect(rendererMappedResult...
2012-08-29 beidson@apple.comREGRESSION: Not sending NPP_SetWindow is causing Flash...
2012-08-29 achicu@adobe.com[CSS Shaders] Use CSS transform parsing code within...
2012-08-29 commit-queue@webki... Web Inspector: Timeline: avoid "IPC message too big...
2012-08-29 annacc@chromium.orgCreate a toggle button for closed captions.
2012-08-29 zmo@google.comUnreviewed, chromium test expectations cleanup.
2012-08-29 commit-queue@webki... [EFL] Add setting API for allow universal/file access...
2012-08-29 wjmaclean@chromium.org[chromium] Link highlight should clear on page navigation.
2012-08-29 jberlin@webkit.orgASSERTION FAILED: enclosingIntRect(rendererMappedResult...
2012-08-29 commit-queue@webki... [EFL] Unskip 2 willSendRequest tests that are passing...
2012-08-29 wangxianzhu@chromi... '\r's in test expectations files confuse chromium-andro...
2012-08-29 jchaffraix@webkit.orgUnreviewed gardening.
2012-08-29 commit-queue@webki... Unreviewed, rolling out r126972.
2012-08-29 vsevik@chromium.orgWeb Inspector: Minor debugger-test polish.
2012-08-29 apavlov@chromium.orgWeb Inspector: Page with @import and :last-child in...
2012-08-29 vsevik@chromium.orgWeb Inspector: Turn workspace into a container of UiSou...
2012-08-29 kadam@inf.u-szeged.hu[WK2] New fast/events/tab-focus-link-in-canvas fails...
2012-08-29 dominik.rottsches... [EFL] Unreviewed EFL gardening.
2012-08-29 fmalita@chromium.orgIncorrect large-area clipping
2012-08-29 dominik.rottsches... [EFL] Move known crash issue to TestExpectations
2012-08-29 dominik.rottsches... [EFL] Unreviewed EFL gardening.
2012-08-29 dominik.rottsches... [EFL] Clean up Skipped file
2012-08-29 commit-queue@webki... [EFL] Rebaseline after r126864
2012-08-29 pdr@google.comUse SVGImage instead of cached image when drawing witho...
2012-08-29 hausmann@webkit.org[Qt] REGRESSION(r125428): fast/profiler/nested-start...
2012-08-29 kadam@inf.u-szeged.hu[Qt][WK1] Unreviewd gardening. Skip failing css3 filter...
2012-08-29 dmazzoni@google.comAX: Canvas should have a distinct role
2012-08-29 dmazzoni@google.comAX: Focusable elements without a role should not be...
2012-08-29 joone@webkit.org[EFL] Unreviewed gardening on the 64bit build bot.
2012-08-29 bashi@chromium.orgstyle->fontMetrics() should be available when setting...
2012-08-29 pdr@google.comUnreviewed rebaseline after r126683
2012-08-29 abarth@webkit.orgcrypto.getRandomValues should throw an exception when...
2012-08-29 abarth@webkit.orgCSP doesn't turn off eval, etc. in Web Workers
2012-08-29 commit-queue@webki... Make MediaSource event dispatch asynchronous.
2012-08-29 jchaffraix@webkit.orgUnreviewed penultimate rebaseline after r126683.
2012-08-29 simon.fraser@apple.comHandle sticky that overflows its container
2012-08-29 wangxianzhu@chromi... [Chromium-Android] Upstream layout test expectations...
2012-08-28 commit-queue@webki... Implement AccessibilityUIElement::titleUIElement()...
2012-08-28 jchaffraix@webkit.orgUnreviewed gardening, more rebaselining after r126911.
2012-08-28 pdr@google.comRebaseline crash-hw-sw-switch.html for Chromium Snow...
2012-08-28 pdr@google.comMark filesystem-url-in-iframe as flaky
2012-08-28 achicu@adobe.com[CSS Filters] Filters should render using sRGB until...
2012-08-28 pdr@google.comRebaseline details-nested-2.html and clone-anonymous...
2012-08-28 jchaffraix@webkit.orgUnreviewed rebaseline after r126911.
2012-08-28 simon.fraser@apple.comRegression (r126774): Crash when scrolling after removi...
2012-08-28 robert@webkit.orgFix up ref-tests added in r126911 to make them more...
2012-08-28 pdr@google.comRebaseline webgl-repaint for slightly different mac...
2012-08-28 jpfau@apple.comMake shared workers respect third-party storage blockin...
next